Šeerìt ga-Pleta
type: Concept
alternative label: Túlélők által alapított közösségek @hu
alternative label: Tі, ŝo vižili v povoênnìj Êvropì
alternative label: Ті, що вижили
alternative label: šeerit ha-pleta @ru-latn
alternative label: Ті, що залишилися в живих
alternative label: шеерит ха-плета @ru
alternative label: Tі, ŝo zališilisâ v živih v povoênnìj Êvropì
broader: 864
in scheme: ehri-terms
preferred label: She'erith Heplatah @it
preferred label: She'erit Hapletah @de
preferred label: ocaleni z Zagłady w Europie po Drugiej wojnie światowej @pl
preferred label: שארית הפליטה @he
preferred label: Túlélők @hu
preferred label: She'erith hapletah @sh
preferred label: пережившие Холокост в послевоенной Европе @ru
preferred label: Шееріт га-Плета
preferred label: She'erith Hapletah @en
preferred label: pereživšie Holokost v poslevoennoj Evrope @ru-latn
scope note: Die letzten Überlebenden, gemeint sind jüdische Überlebende des Holocaust. @de
scope note: Sopravvissuti ai lager @it
scope note: The surviving remnant @en
scope note: Bibliai eredetű, lásd Ezra 9.14. Megmaradtak @hu
scope note: référence biblique, un reste de rechappés, Esdras 9:15 @fr
is or was subject of: il-002798-4019546-3687479
is or was subject of: il-002798-4019597-3686766
is or was subject of: il-002798-4019597-3686775
is or was subject of: il-002798-4019624-5655818
is or was subject of: il-002798-4019660-3691749
is or was subject of: il-002798-4019597-3687021
is or was subject of: il-002798-4019694-3549666
is or was subject of: il-002798-4019624-5656008
is or was subject of: il-002798-4019660-3691747
is or was subject of: il-002798-4019605-3689495
is or was subject of: il-002798-4019719
is or was subject of: il-002798-4019657-3688915
is or was subject of: il-002798-4019597-3686940
is or was subject of: il-002798-4019546-3687187
is or was subject of: il-002798-4019597-3686782
is or was subject of: il-002798-4019657-3690140
is or was subject of: il-002798-4019597-3687014
is or was subject of: il-002798-4019660-3691741
is or was subject of: nl-002896-nl asdniod imagecollection-24389
is or was subject of: il-002798-4019673-3690667
is or was subject of: il-002798-4019657-3688560
is or was subject of: il-002806-jelinek coll
is or was subject of: il-002798-4019546-3687318
is or was subject of: il-002798-4019546-3687483
is or was subject of: il-002798-4019624-5659585
is or was subject of: il-002798-4019657-3687623
is or was subject of: il-002798-4019657-3688613
is or was subject of: il-002798-4019624-5655440
is or was subject of: il-002798-4019546-3687246
is or was subject of: il-002798-4019624-5656065
is or was subject of: il-002798-4019546-3687437
is or was subject of: il-002798-4019546-3687447
is or was subject of: il-002798-4019580-o 30 22
is or was subject of: il-002798-4019624-5656090
is or was subject of: il-002798-9302137-8446566
is or was subject of: il-002798-5084393-5571572
is or was subject of: il-002798-o 46-vilna-o 46 she erith hapletah
is or was subject of: il-002798-4019597-3687018
is or was subject of: nl-002896-nl asdniod imagecollection-24390
is or was subject of: il-002798-6353740-6382765
is or was subject of: il-002798-4019597-3686884
is or was subject of: il-002798-4019657-3687643
is or was subject of: il-002798-4019597-3687016
is or was subject of: il-002798-4019597-3687015
is or was subject of: il-002798-4019657-3687600
is or was subject of: il-002798-5084393-5571590
is or was subject of: il-002798-4019657-3687588
is or was subject of: il-002798-4019717-3726949
is or was subject of: il-002798-4019546-3687448
is or was subject of: nl-002896-nl asdniod imagecollection-14543
is or was subject of: il-002798-4019717-5600043
is or was subject of: il-002798-4019546-3687477
is or was subject of: il-002798-4019624-5656013
is or was subject of: il-002798-4019660-3691748