Poìnformovanìst' pro Golokost
type: Concept
alternative label: Знання про Голокост
alternative label: Verspreiding van informatie over de Holocaust @nl
alternative label: Поширення відомостей про Голокост
alternative label: распространение информации о Холокосте @ru
alternative label: širenje informacija o Holokaustu @sh
alternative label: diffusion d'information à propos (au sujet) de la Shoah @fr
alternative label: Znannâ pro Golokost
alternative label: Poširennâ vìdomostej pro Golokost
alternative label: Rozprzestrzenianie informacji dotyczacej Zagłady @pl
alternative label: rasprostranenie informacii o Holokoste @ru-latn
broader: 1220
in scheme: ehri-terms
narrower: 808
narrower: 790
narrower: 955
narrower: 911
preferred label: connaissance de la Shoah @fr
preferred label: wiedza o Zagładzie @pl
preferred label: знание о Холокосте @ru
preferred label: svijest o Holokaustu @sh
preferred label: Kennis van de Holocaust @nl
preferred label: Conoscenza della Shoah @it
preferred label: Поінформованість про Голокост
preferred label: povědomí o holocaustu @cs
preferred label: Knowledge of the Holocaust @en
preferred label: znanie o Holokoste @ru-latn
preferred label: Wissen über den Holocaust @de
preferred label: Holokauszttal kapcsolatos ismeretek @hu
scope note: Diffusione di informazioni riguardanti la Shoah @it
scope note: Nach Ende des Holocaust. Für die Zeit währenddessen siehe Informationen über die Judenvernichtung @de
is or was subject of: ua-003309-68
is or was subject of: ua-003309-1