Denkmal
in scheme: ehri-terms
is or was subject of: nl-002896-nl asdniod imagecollection-96646
is or was subject of: nl-002896-nl asdniod imagecollection-120999
is or was subject of: nl-002896-nl asdniod imagecollection-123097
is or was subject of: nl-002896-nl asdniod imagecollection-112776
is or was subject of: nl-002896-nl asdniod imagecollection-96688
is or was subject of: ua-003335-p 6022
is or was subject of: nl-002896-nl asdniod imagecollection-96844
is or was subject of: il-002798-11664139
preferred label: pomniki @pl
is or was subject of: nl-002896-nl asdniod imagecollection-120990
preferred label: Пам'ятники @uk
is or was subject of: nl-002896-nl asdniod imagecollection-120998
broader: http://lod.ehri-project-test.eu/vocabularies/ehri-terms/716
is or was subject of: nl-002896-nl asdniod imagecollection-120526
type: Concept
preferred label: אנדרטאות @he
is or was subject of: nl-002896-nl asdniod imagecollection-96846
is or was subject of: nl-002896-nl asdniod imagecollection-120996
is or was subject of: il-002798-4019581-o 32 334
is or was subject of: nl-002896-nl asdniod imagecollection-96855
is or was subject of: nl-002896-nl asdniod imagecollection-120995
preferred label: Monuments @en
preferred label: Pam'âtniki @uk-latn
preferred label: Emlékművek @hu
preferred label: pamâtniki @ru-latn
preferred label: Monumenti @it
is or was subject of: nl-002896-nl asdniod imagecollection-120993
is or was subject of: nl-002896-nl asdniod imagecollection-120511
preferred label: spomenik @sh
alternative label: Monument
scope note: Memorial sites for Nazi victims. @en
preferred label: monument @fr
is or was subject of: nl-002896-nl asdniod imagecollection-96678
is or was subject of: nl-002896-nl asdniod imagecollection-96860
is or was subject of: il-002798-4019581-o 32 248
scope note: zur Erinnerung an die Opfer des Nationalsozialismus
is or was subject of: nl-002896-nl asdniod imagecollection-120529
preferred label: památníky @cs
is or was subject of: nl-002896-nl asdniod imagecollection-120994
is or was subject of: gb-003348-wl1417
is or was subject of: nl-002896-nl asdniod imagecollection-120510
is or was subject of: nl-002896-nl asdniod imagecollection-90925
is or was subject of: nl-002896-nl asdniod imagecollection-9743
is or was subject of: il-002798-4019605-3689590
is or was subject of: il-002798-12715719
is or was subject of: nl-002896-nl asdniod imagecollection-96845
alternative label: Mahnmal
is or was subject of: nl-002896-nl asdniod imagecollection-121000
preferred label: Monumenten @nl
is or was subject of: nl-002896-nl asdniod imagecollection-123113
preferred label: памятники @ru
is or was subject of: nl-002896-nl asdniod imagecollection-120991
is or was subject of: nl-002896-nl asdniod imagecollection-96847