иудаика
scope note: Bücher und Sammelobjekte der jüdischen Kultur und Religion @de
preferred label: Judaïca @nl
scope note: Books or artefacts relating to Judaism @en
broader: http://lod.ehri-project-test.eu/vocabularies/ehri-terms/756
in scheme: ehri-terms
preferred label: iudaika
preferred label: judaica @fr
type: Concept
preferred label: Judaica @cs
preferred label: judaika @pl
is or was subject of: lt-002881-vžm
preferred label: Ûdaïka @uk-latn
preferred label: יודאיקה @he
preferred label: Юдаїка @uk
preferred label: Judaika @hu