ограничения свободы передвижения
type: Concept
broader: 601
broader: 809
in scheme: ehri-terms
narrower: 615
preferred label: Mozgáskorlátozások @hu
preferred label: ograniczenie swobody przemieszczania się @pl
preferred label: ograničenje kretanja @sh
preferred label: Obmežennâ peresuvannâ @uk-latn
preferred label: ograničeniâ svobody peredviženiâ
preferred label: Обмеження пересування @uk
preferred label: restriction à la liberté de mouvement @fr
preferred label: Limitazioni alla libertà di movimento @it
preferred label: הגבלות תנועה @he
preferred label: Beperking van de bewegingsvrijheid @nl
preferred label: omezení pohybu @cs
preferred label: Movement restrictions @en
preferred label: Einschränkung der Freizügigkeit @de
scope note: Restrizioni alla libertà di movimento @it
is or was subject of: md-002886-1589 1
is or was subject of: il-002798-4019572-5089373
is or was subject of: il-002798-4019572-5090137
is or was subject of: il-002798-5083667-4742022
is or was subject of: il-002798-4019572-5089565
is or was subject of: il-002798-4019572-5084729
is or was subject of: md-002886-1577 4
is or was subject of: il-002798-4019694-3731381
is or was subject of: il-002798-4019564
is or was subject of: il-002798-5083667-4440080
is or was subject of: lv-002871-p 70