Berufsverbote
type: Concept
alternative label: Beroepsverboden
broader: 607
in scheme: ehri-terms
preferred label: zakaz zatrudnienia @pl
preferred label: איסור מקצוע @he
preferred label: Zaborona na profesìjnu dìâl'nìst' @uk-latn
preferred label: запрет на профессии @ru
preferred label: Заборона на професійну діяльність @uk
preferred label: Berufsverbot @it
preferred label: interdiction professionnelle @fr
preferred label: zákaz výkonu povolání @cs
preferred label: zapret na professii @ru-latn
preferred label: Foglalkozástól való eltiltás @hu
preferred label: zabrana @sh
scope note: Divieto di esercitare la professione @it
is or was subject of: il-002798-4019624-4422042
is or was subject of: il-002798-10568932
is or was subject of: il-002798-4019605-3689747
is or was subject of: il-002798-6385737
is or was subject of: il-002798-7511641
is or was subject of: de-002624-slg-ed 750-slg 0 59 1-2-ed 750 236
is or was subject of: il-002798-4019605-3689674
is or was subject of: il-002798-4019624-4417840