чистокровные евреи
type: Concept
broader: 365
in scheme: ehri-terms
preferred label: Чистокровні євреї @uk
preferred label: Tiszta vérű zsidók @hu
preferred label: Čistokrovnì êvreï @uk-latn
preferred label: Volljuden (Żydzi bez domieszki obcej krwi) @pl
preferred label: plný Žid @cs
preferred label: čistokrovnye evrei
preferred label: Volljude @de
preferred label: Volljuden @sh
preferred label: Voljoden @nl
scope note: A Nazi term for a person defind as a Jew by Nazi criteria. @en
scope note: personne dont les quatre grands-parents sont juifs @fr
scope note: Ebrei puri @it
scope note: NS-Terminologie @de