presledovaniâ partnërov v smešannyh brakah
preferred label: преследования партнёров в смешанных браках
broader: http://lod.ehri-project-test.eu/vocabularies/ehri-terms/375
preferred label: Pereslìduvannâ partnerìv zì zmìšanih šlûbìv @uk-latn
preferred label: persécution de conjoint d'un mariage mixte @fr
preferred label: Переслідування партнерів зі змішаних шлюбів @uk
preferred label: progon mješanih brakova @sh
type: Concept
in scheme: ehri-terms
preferred label: Vervolging van gemengd-gehuwden @nl
preferred label: Verfolgung von Partnern in Mischehe @de
preferred label: prześladowanie partnerów z małżeństw mieszanych @pl
preferred label: Persecuzione dei coniugi di matrimoni misti @it
preferred label: Vegyes házasságban élő házastársak üldözése @hu
preferred label: Persecution of mixed marriage partners @en
broader: http://lod.ehri-project-test.eu/vocabularies/ehri-terms/641
preferred label: רדיפות בני זוג בנישואי תערובת @iw
preferred label: perzekuce partnerů ze smíšených manželství @cs
scope note: Mischehe im Nationalsozialismus ist die Ehe zwischen von jüdischen und nicht-jüdischen (in NS-Terminologie deutschblütigen) Partnern @de