Тілесні покарання
scope note: Testi fenyítés alkalmazása különböző eszközökkel @hu
preferred label: Flogging @en
alternative label: Afranseling @nl
preferred label: Prügelstrafe @de
alternative label: Porottâ
preferred label: chłosta @pl
alternative label: Auspeitschung @de
preferred label: porka @ru-latn
alternative label: Пороття
preferred label: Korbácsolás @hu
preferred label: šibanje @sh
preferred label: Tìlesnì pokarannâ
preferred label: mrskání @cs
type: Concept
broader: http://lod.ehri-project-test.eu/vocabularies/ehri-terms/601
preferred label: coup de fouet @fr
alternative label: Auspeitschen @de
preferred label: порка @ru
preferred label: Punizioni corporali @it
alternative label: schlague militaire @fr
preferred label: Geseling @nl
in scheme: ehri-terms