Ajnzacgrupi
type: Concept
preferred label: Einsatzgruppen @en
alternative label: Einsatzgruppen der Sicherheitspolizei und des SD @de
alternative label: Мобільні каральні підрозділи
alternative label: Mobіl'nі karal'nі pіdrozdіli
broader: 529
in scheme: ehri-terms
narrower: 531
preferred label: Einsatzgruppe @de
preferred label: ajnzacgruppy @ru-latn
preferred label: айнзацгруппы @ru
preferred label: groupe d'intervention @fr
preferred label: specijalna jedinica Einsatzgruppen @sh
preferred label: grupy operacyjne policji bezpieczeństwa i służby bezpieczeństwa @pl
preferred label: Айнзацгрупи
preferred label: pohotovostní jednotky @cs
preferred label: Kivégző különítmények @hu
scope note: Gruppi operativi @it
scope note: Bevetési csoport, speciális végrehajtó egységek @hu
is or was subject of: de-002624-staatlakt-0 0-9-4-ma 347 1
is or was subject of: de-002624-zs-0 21-zs 3123 1
is or was subject of: de-002624-g-0 2-8-2-gh 02 40 2
is or was subject of: de-002624-zs-0 17-zs 3124 1
is or was subject of: nl-002896-nl asdniod imagecollection-153256
is or was subject of: de-002624-zs-0 1-2-zs 207 2
is or was subject of: de-002624-staatlakt-0 0-2-1-ma 220 1
is or was subject of: de-002624-staatlakt-0 0-9-5-ma 444 1
is or was subject of: de-002624-g-0 2-2-5-mb 45 2
is or was subject of: de-002624-g-0 2-2-5-mb 45 1
is or was subject of: de-002624-ms-0 0-ms 383 3
is or was subject of: de-002624-slg-ed 876-10
is or was subject of: de-002624-zs-0 7-2-zs 907 1
is or was subject of: nl-002896-nl asdniod imagecollection-153261
is or was subject of: de-002624-zs-0 15-3-zs 626 1
is or was subject of: de-002624-zs-0 9-5-zs 992 1
is or was subject of: de-002624-zs-0 22-zs 627 1
is or was subject of: de-002624-staatlakt-0 3-ma 113 6
is or was subject of: de-002624-g-0 2-4-1-gd 01 56 1
is or was subject of: de-002624-g-0 2-4-1-gd 01 54 1
is or was subject of: de-002624-zs-0 1-2-zs 207 1
is or was subject of: nl-002896-nl asdniod imagecollection-153260
is or was subject of: nl-002896-nl asdniod imagecollection-153258
is or was subject of: de-002624-staatlakt-0 0-12-9-ma 707 2
is or was subject of: de-002624-zs-0 3-zs 700 1
is or was subject of: de-002624-zs-0 8-zs 2385 1
is or was subject of: de-002624-g-0 2-20-gy 10 1
is or was subject of: de-002624-g-0 2-2-5-gy 29 1
is or was subject of: nl-002896-nl asdniod imagecollection-153257
is or was subject of: de-002624-staatlakt-0 0-12-9-ma 707 1