pereklička
type: Concept
alternative label: appel'
alternative label: аппель
alternative label: Apel' @uk-latn
alternative label: Zählappell @de
alternative label: Апель @uk
alternative label: Anwesenheitsappell @de
broader: 486
in scheme: ehri-terms
preferred label: Létszámellenőrzések @hu
preferred label: apely @cs
preferred label: Pereklički @uk-latn
preferred label: prozivka @sh
preferred label: перекличка
preferred label: Переклички @uk
preferred label: Appelli @it
preferred label: Roll calls @en
preferred label: Appel @nl
preferred label: appel @fr
preferred label: apele @pl
preferred label: Appell @de
scope note: Im Sinne von Antreten (lassen). Nicht verwenden für Mahnung oder Aufruf @de
is or was subject of: us-005578-irn507377-irn503087
is or was subject of: us-005578-irn507377-irn503072
is or was subject of: nl-003006-easy collection 2-3-urn nbn nl ui 13 mg6 bh8
is or was subject of: us-005578-irn77768-irn510831
is or was subject of: us-005578-irn507377-irn504514
is or was subject of: us-005578-irn78014-irn508720
is or was subject of: us-005578-irn78539-irn78762
is or was subject of: us-005578-irn503572-irn503579
is or was subject of: us-005578-irn77767-irn510183
is or was subject of: us-005578-irn507379-irn505543
is or was subject of: us-005578-irn77768-irn510815
is or was subject of: us-005578-irn503689-irn511810
is or was subject of: us-005578-irn503689-irn511827
is or was subject of: nl-003006-easy collection 2-3-urn nbn nl ui 13 l4b uwb
is or was subject of: us-005578-irn77768-irn510857
is or was subject of: us-005578-irn39751-irn509136
is or was subject of: us-005578-irn502045-irn502571
is or was subject of: us-005578-irn560447-irn47946
is or was subject of: us-005578-irn504424-irn562264
is or was subject of: us-005578-irn78014-irn508728
is or was subject of: us-005578-irn78014-irn508682
is or was subject of: us-005578-irn39098-irn508762
is or was subject of: us-005578-irn505555-irn505585
is or was subject of: us-005578-irn78014-irn508623
is or was subject of: us-005578-irn523956-irn43490
is or was subject of: us-005578-irn507377-irn505491
is or was subject of: nl-003006-easy collection 2-urn nbn nl ui 13 ci2u zr
is or was subject of: us-005578-irn504457-irn508470
is or was subject of: us-005578-irn502045-irn502575
is or was subject of: us-005578-irn546130
is or was subject of: nl-003006-easy collection 2-urn nbn nl ui 13 q6xd 1t
is or was subject of: us-005578-irn560447-irn47948
is or was subject of: us-005578-irn44091-irn563453
is or was subject of: us-005578-irn594392
is or was subject of: us-005578-irn44518-irn45166
is or was subject of: us-005578-irn77768-irn510851
is or was subject of: us-005578-irn514764-irn516335
is or was subject of: nl-003006-easy collection 2-urn nbn nl ui 13 ymwy ol
is or was subject of: us-005578-irn504406-irn511016
is or was subject of: us-005578-irn504424-irn77219
is or was subject of: us-005578-irn552725-irn561059
is or was subject of: us-005578-irn77768-irn510856
is or was subject of: us-005578-irn507963-irn508054
is or was subject of: us-005578-irn500067-irn503246
is or was subject of: us-005578-irn500067-irn502939
is or was subject of: us-005578-irn39098-irn508769
is or was subject of: us-005578-irn507377-irn505488
is or was subject of: us-005578-irn39164-irn512458
is or was subject of: us-005578-irn39607-irn513760
is or was subject of: us-005578-irn504457-irn611761
is or was subject of: us-005578-irn78014-irn515631
is or was subject of: us-005578-irn507907-irn507964
is or was subject of: us-005578-irn73224-irn73327
is or was subject of: us-005578-irn503689-irn511832
is or was subject of: us-005578-irn507963-irn508052
is or was subject of: us-005578-irn506579-irn507489
is or was subject of: us-005578-irn507344-irn507339