Cìnnì êvreï
broader: http://lod.ehri-project-test.eu/vocabularies/ehri-terms/370
scope note: Persone considerate interamente ebree nonostante le origini miste @it
type: Concept
preferred label: Geltungsjuden (uważani za Żydów) @pl
preferred label: Zsidónak minősített személyek @hu
preferred label: Geltungsjude @fr
preferred label: ** привилегированные евреи @ru
scope note: A Nürnbergi törvények alapján zsidónak számító emberek. @hu
preferred label: geltungsjuden @cs
preferred label: Цінні євреї
in scheme: ehri-terms
alternative label: Korisnì êvreï
preferred label: Geltungsjuden @nl
alternative label: Geltungsjüdin @de
scope note: Nazi term for people administratively considered as Jews. @en
broader: http://lod.ehri-project-test.eu/vocabularies/ehri-terms/365
scope note: NS-Terminologie @de
alternative label: Корисні євреї
preferred label: privilegirovannye evrei @ru-latn