Cìnnì êvreï
type: Concept
preferred label: Geltungsjude @fr
alternative label: Korisnì êvreï
alternative label: Geltungsjüdin @de
alternative label: Корисні євреї
broader: 370
broader: 365
in scheme: ehri-terms
preferred label: Geltungsjuden (uważani za Żydów) @pl
preferred label: Zsidónak minősített személyek @hu
preferred label: ** привилегированные евреи @ru
preferred label: geltungsjuden @cs
preferred label: Цінні євреї
preferred label: Geltungsjuden @nl
preferred label: privilegirovannye evrei @ru-latn
scope note: Persone considerate interamente ebree nonostante le origini miste @it
scope note: A Nürnbergi törvények alapján zsidónak számító emberek. @hu
scope note: Nazi term for people administratively considered as Jews. @en
scope note: NS-Terminologie @de