Mіšlіnge
type: Concept
alternative label: hybride @fr
alternative label: лица смешанного еврейско-нееврейского происхождения @ru
alternative label: Мішанці
alternative label: Personen van gemengde afkomst @nl
alternative label: Mìšancì
alternative label: Частково євреї
alternative label: Люди, серед предків яких були євреї
alternative label: Lûdi, sered predkіv âkih buli evreї
alternative label: lica smešannogo evrejsko-neevrejskogo proishoždeniâ @ru-latn
alternative label: Častkovo evreї
broader: 365
broader: 370
broader: 1207
in scheme: ehri-terms
narrower: 581
preferred label: Félvérek @hu
preferred label: métis @fr
preferred label: míšenci @cs
preferred label: Мішлінге
preferred label: полукровки @ru
preferred label: mišlinge @sh
preferred label: Mischling @de
preferred label: Mischlinge @nl
preferred label: Niemcy z domieszką krwi żydowskiej @pl
preferred label: polukrovki @ru-latn
preferred label: Meticci @it
scope note: NS-Terminologie @de
scope note: A Nazi term for people of mixed descent. @en
scope note: Figli di matrimoni misti @it
is or was subject of: de-002624-staatlakt-0 0-8-1-6-ma 667 1
is or was subject of: de-002624-g-0 0-4-g 01 26
is or was subject of: de-002624-nl-ed 558-1
is or was subject of: de-002624-staatlakt-0 0-9-7-ma 434 1
is or was subject of: de-002624-zs-0 4-3-mzs 4
is or was subject of: de-002624-slg-ed 137-1 0
is or was subject of: de-002624-staatlakt-0 0-4-1-ma 125 8
is or was subject of: de-002624-ms-0 0-ms 2150 1
is or was subject of: de-002624-staatlakt-0 0-9-5-ma 441 6
is or was subject of: il-002798-4019580-o 30 84
is or was subject of: de-002624-g-0 2-12-6-gm 07 146 1
is or was subject of: de-002624-zs-0 4-3-mzs 3
is or was subject of: il-002798-4019690-3667625
is or was subject of: de-002624-ms-0 4-ms 546 1
is or was subject of: il-002798-4019580-o 30 18
is or was subject of: lv-002871-p 70
is or was subject of: il-002798-4019690-3665966
is or was subject of: il-002798-4019690-3669576
is or was subject of: il-002798-4019690-3665973
is or was subject of: de-002624-staatlakt-0 0-4-1-ma 125 1
is or was subject of: il-002798-4019624-4422170
is or was subject of: il-002798-4019690-3665972
is or was subject of: de-002624-nl-ed 913-2
is or was subject of: lv-002871-p 1018
is or was subject of: de-002624-nl-ed 913-6
is or was subject of: de-002624-g-0 0-4-g 01 33
is or was subject of: de-002624-staatlakt-0 0-8-1-6-ma 666 1
is or was subject of: de-002624-staatlakt-0 0-9-4-ma 462 1
is or was subject of: cz-002279-collection jmp archive 312-i-2-a-009-document jmp archive 312 i 2 a 009 001
is or was subject of: de-002624-zs-0 1-2-zs 2338 1
is or was subject of: de-002624-g-0 0-4-g 01 29
is or was subject of: cz-002279-collection jmp shoah t-2-a-2-r-144-document jmp shoah t 2 a 2r 144 180
is or was subject of: de-002624-g-0 0-4-g 01 32
is or was subject of: de-002624-staatlakt-0 0-12-6-ma 172 1
is or was subject of: de-002624-g-0 0-4-g 01 36
is or was subject of: de-002624-staatlakt-0 0-10-1-ma 192 1
is or was subject of: cz-002279-collection jmp shoah t-2-a-10k 327-253-document jmp shoah t 2 a 10k 327 253 047
is or was subject of: de-002624-ms-0 4-ms 761 1
is or was subject of: de-002624-g-0 2-12-6-gm 07 94 7 2
is or was subject of: de-002624-staatlakt-0 0-9-5-ma 444 4
is or was subject of: de-002624-zs-0 6-zs 2433 1
is or was subject of: de-002624-g-0 2-6-3-mb 4 1
is or was subject of: il-002798-4019580-o 30 167
is or was subject of: il-002798-4019580-o 30 53
is or was subject of: il-002798-4070553
is or was subject of: de-002624-staatlakt-0 0-9-5-ma 641 1
is or was subject of: de-002624-staatlakt-0 0-13-1-1-ma 136 1
is or was subject of: cz-002279-collection jmp archive 312-iii-6-110-document jmp archive 312 iii 6 110 001
is or was subject of: de-002624-g-0 2-2-9-gb 10 17 1