Marking of Jews
type: Concept
alternative label: Armband
alternative label: Aanduiden van Joden @nl
alternative label: opaska z gwiazdą Dawida @pl
alternative label: brassard @fr
alternative label: нарукавная повязка (опознавательный знак для евреев) @ru
alternative label: povez na ruci @sh
alternative label: Yellow badge
alternative label: Нарукавна пов'язка @uk
alternative label: Narukavna pov'âzka @uk-latn
alternative label: narukavnaâ povâzka (opoznavatel'nyj znak dlâ evreev) @ru-latn
alternative label: Badge of shame
broader: 332
broader: 339
in scheme: ehri-terms
preferred label: oznakowanie Żydów @pl
preferred label: Kennzeichnung von Juden @de
preferred label: Zsidók megjelölése @hu
preferred label: опознавательные знаки для евреев @ru
preferred label: Markeren van Joden @nl
preferred label: Markіruvannâ єvreїv @uk-latn
preferred label: označování Židů @cs
preferred label: Marcatura degli ebrei @it
preferred label: סימון יהודים @he
preferred label: Маркірування євреїв @uk
preferred label: opoznavatel'nye znaki dlâ evreev @ru-latn
preferred label: označavanje Židova @sh
preferred label: marquage des Juifs @fr
scope note: Fascia al braccio; marchio d'infamia; contrassegno giallo @it
scope note: For non-Jews see "Armband (for non Jews)"
is or was subject of: nl-002896-nl asdniod imagecollection-163740
is or was subject of: nl-002896-nl asdniod imagecollection-161354
is or was subject of: nl-002896-nl asdniod imagecollection-107559
is or was subject of: nl-002896-nl asdniod imagecollection-193649
is or was subject of: ua-003332-p 1951
is or was subject of: il-002798-6256405
is or was subject of: il-002798-4019542-3714566
is or was subject of: nl-002896-nl asdniod imagecollection-140702
is or was subject of: be-002157-kd 00141
is or was subject of: il-002798-4019542-3714258
is or was subject of: ua-003305-p 2726
is or was subject of: il-002798-3763421-3552520
is or was subject of: be-002157-kd 00576
is or was subject of: nl-002896-nl asdniod imagecollection-161417
is or was subject of: il-002798-4019542-3714481
is or was subject of: be-002157-kd 00348
is or was subject of: nl-002896-nl asdniod imagecollection-161495
is or was subject of: nl-002896-nl asdniod imagecollection-161309
is or was subject of: ua-003335-p 1395
is or was subject of: nl-002896-nl asdniod imagecollection-114300
is or was subject of: be-002157-kd 00707
is or was subject of: nl-002896-nl asdniod imagecollection-73758
is or was subject of: nl-002896-nl asdniod imagecollection-161168
is or was subject of: il-002798-4019542-3714287
is or was subject of: il-002798-5263688-5338927
is or was subject of: be-002157-kd 00717
is or was subject of: il-002798-3763421-3552492
is or was subject of: il-002798-4019605-3689506
is or was subject of: nl-002896-nl asdniod imagecollection-161169
is or was subject of: nl-002896-nl asdniod imagecollection-153055
is or was subject of: be-002157-kd 00094
is or was subject of: nl-002896-nl asdniod imagecollection-161074
is or was subject of: il-002798-4019572-5089565
is or was subject of: il-002798-4019624-4421693
is or was subject of: nl-002896-nl asdniod imagecollection-161297
is or was subject of: il-002798-4019542-3714598
is or was subject of: nl-002896-nl asdniod imagecollection-115016
is or was subject of: nl-002896-nl asdniod imagecollection-66318
is or was subject of: ua-003332-p 2792
is or was subject of: nl-002896-nl asdniod imagecollection-96945
is or was subject of: nl-002896-nl asdniod imagecollection-161346
is or was subject of: nl-002896-nl asdniod imagecollection-161037
is or was subject of: nl-002896-nl asdniod imagecollection-66443
is or was subject of: il-002798-13296500
is or was subject of: il-002798-3763421-3552544
is or was subject of: nl-002896-nl asdniod imagecollection-114298
is or was subject of: nl-002896-nl asdniod imagecollection-161562
is or was subject of: nl-002896-nl asdniod imagecollection-161527
is or was subject of: nl-002896-nl asdniod imagecollection-14568