Gyámság
type: Concept
alternative label: Gondnokság
alternative label: Obhut @de
broader: 276
in scheme: ehri-terms
preferred label: poručnictví @cs
preferred label: starateljstvo @sh
preferred label: Tutela @it
preferred label: Vormundschaft @de
preferred label: попечительство @ru
preferred label: Guardianship @en
preferred label: kuratela @pl
preferred label: popečitel'stvo @ru-latn
preferred label: Opìka @uk-latn
preferred label: Опіка @uk
preferred label: tutelle @fr
preferred label: Voogdijschap @nl
preferred label: אפוטרופסות @he
scope note: Refering to guardianship of or by Jews. @en
is or was subject of: md-002886-183 1 3
is or was subject of: lv-002871-p 1026
is or was subject of: lv-002871-p 69
is or was subject of: lv-002871-p 80
is or was subject of: lv-002871-1398