действия с целью предотвратить депортацию
preferred label: Attività per evitare la deportazione @it
preferred label: Activiteiten om deportatie te voorkomen @nl
preferred label: Versuch Deportationen zu verhindern @de
is or was subject of: il-002798-4019672
scope note: All kinds of attempts to prevent deportation, resistance, protests, propaganda etc. @en
broader: http://lod.ehri-project-test.eu/vocabularies/ehri-terms/256
preferred label: akcija sprečavanja deportacija @sh
preferred label: action pour prévenir la déportation @fr
in scheme: ehri-terms
type: Concept
preferred label: Activities to prevent deportation @en
preferred label: A deportálások megakadályozására irányuló tevékenységek @hu
preferred label: aktivity k zabránění deportace @cs
preferred label: Dìâl'nìst' za zapobìgannâ deportacìï @uk-latn
preferred label: Діяльність за запобігання депортації @uk
preferred label: działania w celu uniemożliwienia deportacji @pl
preferred label: dejstviâ s cel'û predotvratit' deportaciû