Добровільні помічники вермахту
alternative label: Dobrovìl'nij pomìčnik
type: Concept
alternative label: Хіві
scope note: A német hadsereg szolgálatában álló keleti népekből toborzott segédcsapatok megnevezése. @hu
preferred label: Dobrovіl'nі pomіčniki vermahtu
alternative label: Hіvi
preferred label: dobrovolníci @cs
preferred label: wolontariusze jednostek pomocniczych policji @pl
alternative label: dobrovol'cy na službe u Vermahta @ru-latn
preferred label: auxiliaire volontaire @fr
in scheme: ehri-terms
preferred label: Hilfswillige @nl
alternative label: Dobrovìl'na pomìčnicâ
alternative label: hiwis @sh
is or was subject of: ua-003292-р 2483
preferred label: хиви @ru
alternative label: добровольцы на службе у Вермахта @ru
preferred label: Ausiliari @it
alternative label: Добровільна помічниця
preferred label: hivi @ru-latn
alternative label: Добровільний помічник
broader: http://lod.ehri-project-test.eu/vocabularies/ehri-terms/223
preferred label: hilfswillige @sh
preferred label: Önkéntes segítők @hu