osoby postronne
is or was subject of: nl-003006-easy collection 2-urn nbn nl ui 13 vly n2m
alternative label: Osoby trzecie
is or was subject of: nl-003006-easy collection 2-urn nbn nl ui 13 l6i h8l
is or was subject of: nl-003006-easy collection 2-urn nbn nl ui 13 9ry 5xt
is or was subject of: nl-003006-easy collection 2-urn nbn nl ui 13 g2z k8i
is or was subject of: nl-003006-easy collection 2-urn nbn nl ui 13 76o 0u6
alternative label: spectatrice @fr
is or was subject of: nl-003006-easy collection 2-urn nbn nl ui 13 oxy te4
preferred label: Zuschauer @de
is or was subject of: nl-003006-easy collection 2-urn nbn nl ui 13 uyy cuc
is or was subject of: nl-003006-easy collection 2-urn nbn nl ui 13 b13 v39
preferred label: promatrač @sh
is or was subject of: nl-003006-easy collection 2-urn nbn nl ui 13 e15 59t
is or was subject of: nl-003006-easy collection 2-urn nbn nl ui 13 7ea et9
preferred label: Спостерігачі @uk
is or was subject of: nl-003006-easy collection 2-urn nbn nl ui 13 7gc zp2
is or was subject of: nl-003006-easy collection 2-urn nbn nl ui 13 rva xrs
is or was subject of: lt-002882-f k 30 ap 1
is or was subject of: nl-003006-easy collection 2-urn nbn nl ui 13 nqm yhu
is or was subject of: nl-003006-easy collection 2-urn nbn nl ui 13 dpo wpz
preferred label: témoin @fr
alternative label: Mitläufer @de
is or was subject of: nl-003006-easy collection 2-urn nbn nl ui 13 x0v jmy
preferred label: přihlížející @cs
is or was subject of: nl-003006-easy collection 2-urn nbn nl ui 13 u31 viv
is or was subject of: nl-003006-easy collection 2-urn nbn nl ui 13 5zj r8m
is or was subject of: nl-003006-easy collection 2-urn nbn nl ui 13 rgf 64g
is or was subject of: lt-002882-f k 1 ap 58
preferred label: Tétlen jelenlévők @hu
preferred label: storonnie nablûdateli @ru-latn
preferred label: сторонние наблюдатели @ru
is or was subject of: nl-003006-easy collection 2-urn nbn nl ui 13 l2p w5j
is or was subject of: nl-003006-easy collection 2-urn nbn nl ui 13 n35 4xc
is or was subject of: nl-003006-easy collection 2-urn nbn nl ui 13 ppw poq
is or was subject of: nl-003006-easy collection 2-urn nbn nl ui 13 tqx ti8
is or was subject of: nl-003006-easy collection 2-urn nbn nl ui 13 s9x adi
is or was subject of: nl-003006-easy collection 2-urn nbn nl ui 13 447 v55
alternative label: spectateur @fr
is or was subject of: nl-003006-easy collection 2-urn nbn nl ui 13 kly cry
is or was subject of: nl-003006-easy collection 2-urn nbn nl ui 13 3bu sya
broader: http://lod.ehri-project-test.eu/vocabularies/ehri-terms/173
is or was subject of: nl-003006-easy collection 2-urn nbn nl ui 13 d63 uo2
preferred label: Bystanders @en
is or was subject of: nl-003006-easy collection 2-urn nbn nl ui 13 86c 039
alternative label: Świadkowie
is or was subject of: nl-003006-easy collection 2-urn nbn nl ui 13 6e0 7w3
is or was subject of: http://lod.ehri-project-test.eu/units/de-002475-01-03-01-05
is or was subject of: nl-003006-easy collection 2-urn nbn nl ui 13 2j5 qs4
type: Concept
is or was subject of: nl-003006-easy collection 2-urn nbn nl ui 13 b9g 86l
is or was subject of: nl-003006-easy collection 2-urn nbn nl ui 13 rib vrz
preferred label: Astanti @it
is or was subject of: nl-003006-easy collection 2-urn nbn nl ui 13 56g 05f
is or was subject of: nl-003006-easy collection 2-urn nbn nl ui 13 xao dnw
is or was subject of: nl-003006-easy collection 2-urn nbn nl ui 13 g8l0 sp
scope note: Testimoni passivi di atti violenti e crimini @it
is or was subject of: se-006621-judiska minnen
is or was subject of: nl-003006-easy collection 2-urn nbn nl ui 13 pet 7uc
is or was subject of: nl-003006-easy collection 2-urn nbn nl ui 13 q1v ipb
preferred label: Omstanders @nl
is or was subject of: nl-003006-easy collection 2-urn nbn nl ui 13 6zu n5o
is or was subject of: nl-003006-easy collection 2-urn nbn nl ui 13 1y0 5bc
is or was subject of: nl-003006-easy collection 2-urn nbn nl ui 13 ysp4 eo
is or was subject of: nl-003006-easy collection 2-urn nbn nl ui 13 xxy 2kb
preferred label: Sposterìgačì @uk-latn
in scheme: ehri-terms
is or was subject of: nl-003006-easy collection 2-urn nbn nl ui 13 e1t or7
is or was subject of: nl-003006-easy collection 2-urn nbn nl ui 13 8mi ih4