Руководитель СС и полицейфюрер
type: Concept
alternative label: Načal'nik SS і polіcії
alternative label: Начальник СС і поліції
alternative label: SSPF @en
alternative label: Komanduvač SS ì polìcìï
alternative label: Командувач СС і поліції
alternative label: SS und Polizeifuehrer @nl
broader: 1188
in scheme: ehri-terms
narrower: 1164
preferred label: SS i Polizeiführer @sh
preferred label: SS a policejní velitel @cs
preferred label: chef de la SS et de la police @fr
preferred label: SS- und Polizeiführer @it
preferred label: načal'nik SS i policii @ru-latn
preferred label: dowódca SS i policji @pl
preferred label: SS és rendőrfőnök @hu
preferred label: Rukovoditel' SS i policejfûrer
preferred label: SS und Polizeiführer @de
preferred label: начальник СС и полиции @ru
scope note: Comandanti delle SS e della Polizia @it
scope note: milice du parti nazi et chef de la police @fr
is or was subject of: lt-002880-f r 683