Зондеркоманди
is or was subject of: us-005578-irn77767-irn510183
preferred label: sonderkommanda @cs
preferred label: Commando spécial @fr
is or was subject of: us-005578-irn504424-irn554056
is or was subject of: us-005578-irn507656-irn515097
scope note: Különleges bevetési csoportok @hu
is or was subject of: de-002624-staatlakt-0 0-12-9-ma 707 1
is or was subject of: de-002480-g 12 a
preferred label: Holttesteket kezelő haláltábori egységek @hu
in scheme: ehri-terms
is or was subject of: us-005578-irn500067-irn503044
is or was subject of: us-005578-irn500067-irn502892
scope note: Jewish corps burning units in Death Camps see also Arbeitskommandos. @en
preferred label: Sonderkommando @de
is or was subject of: us-005578-irn714997
preferred label: Zonderkomandi
preferred label: zonderkomandy @ru-latn
is or was subject of: us-005578-irn523956-irn43068
is or was subject of: us-005578-irn78014-irn565840
is or was subject of: de-002624-zs-0 17-zs 1413 1
preferred label: зондеркоманды @ru
is or was subject of: us-005578-irn500067-irn502805
is or was subject of: us-005578-irn39751-irn509199
scope note: Reparti speciali @it
is or was subject of: us-005578-irn502721
is or was subject of: us-005578-irn502870
is or was subject of: us-005578-irn518549
is or was subject of: us-005578-irn504457-irn504704
is or was subject of: us-005578-irn503422
is or was subject of: us-005578-irn505555-irn505559
is or was subject of: us-005578-irn507789-irn507908
preferred label: Sonderkommandos @sh
is or was subject of: us-005578-irn77768-irn510825
is or was subject of: us-005578-irn518305
is or was subject of: de-002624-staatlakt-0 0-12-9-ma 707 2
is or was subject of: de-002624-staatlakt-0 0-2-1-ma 220 1
is or was subject of: us-005578-irn507789-irn510442
broader: http://lod.ehri-project-test.eu/vocabularies/ehri-terms/498
preferred label: komanda specjalne @pl
is or was subject of: us-005578-irn723096-irn503649
is or was subject of: de-002624-zs-0 0-zs 399 1
is or was subject of: us-005578-irn507656-irn47602
is or was subject of: us-005578-irn500067-irn502910
is or was subject of: us-005578-irn500067-irn503259
type: Concept
is or was subject of: de-002624-g-0 0-4-g 01 23
is or was subject of: us-005578-irn39751-irn509082
is or was subject of: us-005578-irn512934
is or was subject of: us-005578-irn671551-irn14216
is or was subject of: us-005578-irn44518-irn45157