Денацифікація
type: Concept
alternative label: Денонсування (договору)
broader: 1220
in scheme: ehri-terms
preferred label: денацификация @ru
preferred label: denazyfikacja @pl
preferred label: denacifikace @cs
preferred label: Denazificazione @it
preferred label: denacifikacija @sh
preferred label: Denazification @en
preferred label: denacifikaciâ @ru-latn
preferred label: Entnazifizierung @de
preferred label: Denazificatie @nl
preferred label: dénazification @fr
preferred label: Nácitlanítás @hu
preferred label: דה-נאציפיקציה @he
preferred label: Denacifìkacìâ
scope note: A náci berendezkedés felszámolása a háború után @hu
is or was subject of: at-001892-50001704
is or was subject of: cz-002286-1463
is or was subject of: us-005578-irn519450
is or was subject of: de-002624-ms-0 4-ms 345 1
is or was subject of: us-005578-irn504457-irn44419
is or was subject of: de-004838-k 700-polizeipräsidium bochum
is or was subject of: de-002624-ms-0 6-ms 200 48 1
is or was subject of: de-002624-nl-ed 157-nl 0 29 2-2-ed 157 30
is or was subject of: de-002632-mso
is or was subject of: at-001892-50001604
is or was subject of: cz-002286-615
is or was subject of: de-002624-nl-ed 127-1
is or was subject of: de-002624-nl-ed 385-nl 0 57 1-ed 385 2
is or was subject of: de-002624-ms-0 4-ms 2049 1
is or was subject of: de-002632-mf-20
is or was subject of: de-004837-regierung aachen-br 1055
is or was subject of: de-002624-zs-0 10-2-zs 3067 1
is or was subject of: de-002624-ms-0 4-ms 321 2
is or was subject of: at-001848-60004504
is or was subject of: at-001873-40002804
is or was subject of: us-005578-irn504424-irn507538
is or was subject of: de-002624-ms-0 4-ms 354 1
is or was subject of: de-002624-ms-0 0-ms 2088 1
is or was subject of: de-002624-nl-ed 112-6
is or was subject of: de-002624-nl-ed 318-nl 0 47 1-ed 318 25
is or was subject of: de-002624-staatlakt-0 1-1-1-1-ma 1304 1
is or was subject of: cz-002286-1023
is or was subject of: de-002624-ms-0 6-ms 200 193
is or was subject of: de-002570-465 c mannheim