étudiant / étudiante
type: Concept
alternative label: Student @de
alternative label: Diákok @hu
alternative label: student @sh
preferred label: studenti @cs
alternative label: élève
alternative label: étudiante
alternative label: Studentin @de
alternative label: studentica @sh
alternative label: étudiant
broader: 1134
broader: 1207
in scheme: ehri-terms
narrower: 916
preferred label: Studenti @it
preferred label: Hallgatók @hu
preferred label: studenci @pl
preferred label: student / studentica @sh
preferred label: Студенти @uk
preferred label: студенты @ru
preferred label: סטודנטים @he
preferred label: studenty @ru-latn
preferred label: Studenten @nl
preferred label: Student / Studentin @de
preferred label: Students @en
scope note: élève sécondaire; étudiant , étudiante université
is or was subject of: il-002798-4019611-3739190
is or was subject of: lt-002880-f 790
is or was subject of: be-002125-be ara agr 510 iii 0039
is or was subject of: gb-003348-wl3000 9 1-818
is or was subject of: nl-002896-mf1510992-mf1515297-mf2704485-mf3559096
is or was subject of: cz-002286-1578
is or was subject of: de-002624-nl-ed 558-3
is or was subject of: gb-003348-wl855
is or was subject of: il-002781-il cahjp ort ph
is or was subject of: nl-002896-nl asdniod imagecollection-161529
is or was subject of: il-002798-il yad vashem collection of historical photographs
is or was subject of: us-005554-usa yivo rg 120
is or was subject of: be-006093-be ara2 agr2 pjp bruxelles gpp brussel
is or was subject of: nl-002896-mf1510992-mf1515297-mf2704793
is or was subject of: nl-002896-nl asdniod imagecollection-161563
is or was subject of: nl-003006-easy collection 2-urn nbn nl ui 13 tyy 88x
is or was subject of: nl-002896-mf1510992-mf1515297-mf2704485-mf3401249
is or was subject of: il-002798-12642174
is or was subject of: il-002798-6349813
is or was subject of: nl-002896-mf1510992-mf1515297-mf2704762
is or was subject of: nl-002896-nl asdniod imagecollection-161594
is or was subject of: il-002798-6351241
is or was subject of: nl-002896-nl asdniod imagecollection-111634
is or was subject of: nl-002896-mf1510992-mf1515297-mf2704711
is or was subject of: it-002843-provv stud mant-sec vers
is or was subject of: gb-003348-wl1554
is or was subject of: gb-003348-wl515
is or was subject of: il-002798-4019546-3687183
is or was subject of: gb-003348-65657
is or was subject of: us-005554-usa yivo rg 235
is or was subject of: nl-002896-nl asdniod imagecollection-111635
is or was subject of: gb-003348-wl2210
is or was subject of: us-005554-usa yivo rg 116
is or was subject of: be-002125-be a0510 1645
is or was subject of: de-002624-staatlakt-0 0-8-2-3-ma 228 1
is or was subject of: nl-002896-nl asdniod imagecollection-161564
is or was subject of: nl-003006-easy collection 2-urn nbn nl ui 13 jys p3x
is or was subject of: cz-002279-collection jmp shoah t-2-a-10k 327-091-document jmp shoah t 2 a 10k 327 091 003
is or was subject of: de-002624-staatlakt-0 0-8-2-3-ma 533 1
is or was subject of: gb-003348-wl1253
is or was subject of: nl-002896-mf1510992-mf1515297-mf2704485-mf2704486
is or was subject of: il-002798-4019546-3687182
is or was subject of: it-002843-provv stud mant
is or was subject of: it-002843-provv stud mant-sec vers-36
is or was subject of: il-002798-10608370