Aktivіsti v arhіvah pam'âtі žertv Golokostu
type: Concept
alternative label: Gedenkstätten-Mitarbeiter @de
alternative label: Дослідники в архівах меморіалів Голокосту
alternative label: Gedenkstätten-Mitarbeiterin @de
alternative label: militant pour la constitution d'archives sur la mémoire de la Shoah @fr
alternative label: militante pour la constitution d'archives sur la mémoire de la Shoah @fr
alternative label: Doslìdniki v arhìvah memorìalìv Golokostu
broader: 1207
in scheme: ehri-terms
preferred label: militant pour la constitution d'archives sur la mémoire de la Shoah / militante pour la constitution d'archives sur la mémoire de la Shoah @fr
preferred label: Attivisti negli archivi dei luoghi della memoria @it
preferred label: Aktivisták holokauszt-levéltárakban @hu
preferred label: istraživači u memorijalnim arhivima Holokausta @sh
preferred label: Voorstanders van Holocaust herinneringscentra @nl
preferred label: aktivisty sobiraniâ arhivov istorii Holokosta @ru-latn
preferred label: активисты собирания архивов истории Холокоста @ru
preferred label: aktywiści w archiwach pamięci Zagłady @pl
preferred label: Gedenkstätten-Mitarbeiter / Gedenkstätten-Mitarbeiterin @de
preferred label: Lidé působící v archivech holocaustu @cs
preferred label: Activists in Holocaust memorial archives @en
preferred label: Активісти в архівах пам'яті жертв Голокосту
scope note: Attivisti per la costituzione di archivi dei luoghi della memoria; Collaboratori degli archivi dei luoghi della memoria @it