Рейхскомісаріат
scope note: Commissariato del Reich @it
type: Concept
preferred label: Birodalmi megbízott hivatala @hu
preferred label: Rejhskomìsarìat
preferred label: rejhskomissariat @ru-latn
preferred label: říšský komisariát @cs
preferred label: рейхскомиссариат @ru
broader: http://lod.ehri-project-test.eu/vocabularies/ehri-terms/1181
scope note: région administrative de l'Europe de l'Est sous occupation nazie @fr
preferred label: Komisariat Rzeszy @pl
in scheme: ehri-terms
preferred label: Reichskommissariat @fr