Рейхскомісаріат
type: Concept
broader: 1181
in scheme: ehri-terms
preferred label: Birodalmi megbízott hivatala @hu
preferred label: Rejhskomìsarìat
preferred label: rejhskomissariat @ru-latn
preferred label: říšský komisariát @cs
preferred label: рейхскомиссариат @ru
preferred label: Komisariat Rzeszy @pl
preferred label: Reichskommissariat @fr
scope note: Commissariato del Reich @it
scope note: région administrative de l'Europe de l'Est sous occupation nazie @fr