landkomissar
type: Concept
broader: 1185
in scheme: ehri-terms
preferred label: zemský komisař @cs
preferred label: ландкомиссар
preferred label: Területi megbízott @hu
preferred label: Ландкомісар @uk
preferred label: landkommissar @pl
preferred label: Landkomìsar @uk-latn
preferred label: Landkommissar @nl
preferred label: commissaire d'une circonscription rurale en Allemagne @fr
scope note: The head of a county or a country region in occupied German territories. Subordinate to a Kreishauptmann. @en
scope note: Commissario a capo di una circoscrizione nei territori occupati @it