Štadtskomìsar
type: Concept
alternative label: Mìs'kìj komìsar
alternative label: Міській комісар
broader: 1185
in scheme: ehri-terms
preferred label: Stadtkommissar @nl
preferred label: štadtkomissar @ru-latn
preferred label: komisarz miasta @pl
preferred label: městský komisař @cs
preferred label: Штадтскомісар
preferred label: штадткомиссар @ru
preferred label: Városi tisztviselő @hu
scope note: Commissario (sindaco) di una città nei territori occupati @it
scope note: The head of a town in occupied German territories. Subordinate to a Kreishauptmann. @en
is or was subject of: ua-003336-p 1433