крайзгауптман
type: Concept
alternative label: krajzhauptman
alternative label: chef d'arrondissement en Pologne occupée @fr
broader: 1183
in scheme: ehri-terms
narrower: 1186
narrower: 1187
preferred label: Kerületi vezető @hu
preferred label: Kreishauptmann @fr
preferred label: Крайсгауптман @uk
preferred label: kreishauptmann @cs
preferred label: viši administrativni dužnosnik @sh
preferred label: Krajsgauptman @uk-latn
preferred label: krajzgauptman
preferred label: Kreishauptmann / starosta @pl
scope note: The head of a county in parts of Germany and in occupied German territories. In Poland subordinate to a Gouverneur des Distrikts. @en
scope note: Comandante di zona @it