крайзгауптман
alternative label: krajzhauptman
scope note: The head of a county in parts of Germany and in occupied German territories. In Poland subordinate to a Gouverneur des Distrikts. @en
preferred label: Kerületi vezető @hu
preferred label: Kreishauptmann @fr
type: Concept
scope note: Comandante di zona @it
preferred label: Крайсгауптман @uk
preferred label: kreishauptmann @cs
preferred label: viši administrativni dužnosnik @sh
broader: http://lod.ehri-project-test.eu/vocabularies/ehri-terms/1183
preferred label: Krajsgauptman @uk-latn
narrower: http://lod.ehri-project-test.eu/vocabularies/ehri-terms/1186
preferred label: krajzgauptman
in scheme: ehri-terms
narrower: http://lod.ehri-project-test.eu/vocabularies/ehri-terms/1187
preferred label: Kreishauptmann / starosta @pl
alternative label: chef d'arrondissement en Pologne occupée @fr