штадтгауптман (в оккупированной Польше)
type: Concept
broader: 1183
in scheme: ehri-terms
preferred label: Stadthauptmann @sh
preferred label: Штадтгауптман @uk
preferred label: starosta miasta @pl
preferred label: Polgármester @hu
preferred label: Štadtgauptman @uk-latn
preferred label: stadthauptmann @cs
preferred label: štadtgauptman (v okkupirovannoj Pol'še)
scope note: Capo dell'amministrazione civile di una città nella Polonia occupata @it
scope note: v okkupirovannoj Pol'še
scope note: dirigeant à la tête d'une ville @fr
scope note: The head of a big town in occupied German territories. In Poland subordinate to a Gouverneur des Distrikts. @en