Kreisleiter
preferred label: kreisleter @cs
broader: http://lod.ehri-project-test.eu/vocabularies/ehri-terms/1177
type: Concept
alternative label: chef de Kreis
preferred label: kreisleiter @pl
preferred label: крайсляйтер @ru
preferred label: Крайсляйтер @uk
preferred label: Megyei politikai vezető @hu
scope note: A leader of a "Kreis" (county) in the Nazi party. @en
preferred label: krajslâjter @ru-latn
in scheme: ehri-terms
scope note: Dirigente di zona del partito nazista @it
narrower: http://lod.ehri-project-test.eu/vocabularies/ehri-terms/1179
alternative label: bataliony pracy @pl
preferred label: Krajslâjter @uk-latn