Fol'ksdojče
type: Concept
alternative label: Volksdeutscher @de
alternative label: Етнічні німці, які жили за межами Німеччини
alternative label: Etnіčnі nіmcі, âkі žili za mežami Nіmeččini
alternative label: Allemande éthnique @fr
alternative label: Volksdeutsche Frau @de
alternative label: Allemand ethnique @fr
broader: 1062
broader: 1207
in scheme: ehri-terms
preferred label: folksdojcze @pl
preferred label: Allemand ethnique / Allemande éthnique @fr
preferred label: Népi német @hu
preferred label: Volksdeutsche @en
preferred label: Volksduitsers @nl
preferred label: fol'ksdojče @ru-latn
preferred label: Volksdeutscher / Volksdeutsche Frau @de
preferred label: фольксдойче @ru
preferred label: Фольксдойче
scope note: Persone di origini tedesche residenti fuori dal Reich @it
is or was subject of: il-002798-4019542-3714420
is or was subject of: ua-003293-p 3071
is or was subject of: il-002798-4019605-3689684
is or was subject of: sk-003263-24444
is or was subject of: ua-003331-р 2638
is or was subject of: ua-003296-p 2311
is or was subject of: ua-003292-p 49
is or was subject of: ua-003328-р 1876
is or was subject of: de-002624-ms-0 4-ms 461 1
is or was subject of: il-002798-4019624-4416670
is or was subject of: il-002798-4019624-4420189
is or was subject of: ua-003296-p 2567
is or was subject of: cz-002286-556
is or was subject of: sk-003263-24447
is or was subject of: il-002798-4019690-3665969
is or was subject of: il-002798-13395675
is or was subject of: ua-003337-p 1151
is or was subject of: il-002798-4019624-4418873