Fol'ksdojče
broader: http://lod.ehri-project-test.eu/vocabularies/ehri-terms/1062
preferred label: folksdojcze @pl
is or was subject of: il-002798-4019542-3714420
is or was subject of: ua-003293-p 3071
broader: http://lod.ehri-project-test.eu/vocabularies/ehri-terms/1207
is or was subject of: il-002798-4019605-3689684
is or was subject of: sk-003263-24444
preferred label: Allemand ethnique / Allemande éthnique @fr
is or was subject of: ua-003331-р 2638
alternative label: Volksdeutscher @de
is or was subject of: ua-003296-p 2311
is or was subject of: ua-003292-p 49
is or was subject of: ua-003328-р 1876
preferred label: Népi német @hu
is or was subject of: de-002624-ms-0 4-ms 461 1
is or was subject of: il-002798-4019624-4416670
preferred label: Volksdeutsche @en
is or was subject of: il-002798-4019624-4420189
scope note: Persone di origini tedesche residenti fuori dal Reich @it
is or was subject of: ua-003296-p 2567
is or was subject of: cz-002286-556
is or was subject of: sk-003263-24447
preferred label: Volksduitsers @nl
preferred label: fol'ksdojče @ru-latn
alternative label: Етнічні німці, які жили за межами Німеччини
in scheme: ehri-terms
alternative label: Etnіčnі nіmcі, âkі žili za mežami Nіmeččini
is or was subject of: il-002798-4019690-3665969
type: Concept
alternative label: Allemande éthnique @fr
preferred label: Volksdeutscher / Volksdeutsche Frau @de
alternative label: Volksdeutsche Frau @de
is or was subject of: il-002798-13395675
is or was subject of: ua-003337-p 1151
alternative label: Allemand ethnique @fr
is or was subject of: il-002798-4019624-4418873
preferred label: фольксдойче @ru
preferred label: Фольксдойче