Угорська окупація
alternative label: Ungarische Besatzung @de
preferred label: венгерская оккупация @ru
is or was subject of: ua-003309-68
alternative label: Okupacìâ Ugorŝinoû
preferred label: mađarska okupacija @sh
in scheme: ehri-terms
alternative label: Окупація Угорщиною
alternative label: Okupacje - przez Węgry @pl
narrower: http://lod.ehri-project-test.eu/vocabularies/ehri-terms/1032
broader: http://lod.ehri-project-test.eu/vocabularies/ehri-terms/632
alternative label: Bezetting - door Hongarije @nl
preferred label: occupation hongroise @fr
preferred label: Hungarian occupation @en
type: Concept
preferred label: Magyar megszállás @hu
preferred label: Occupazione ungherese @it
preferred label: Hongaarse bezetting @nl
scope note: Occupazione di territori da parte dell'Ungheria @it
preferred label: Ugors'ka okupacìâ
preferred label: Ungarische Besetzung @de
alternative label: occupation par la Hongrie @fr
preferred label: vengerskaâ okkupaciâ @ru-latn
preferred label: okupacja węgierska @pl
preferred label: okupace Maďarska @cs
alternative label: okupacija od strane Mađarske @sh