EHRI Camps
type: ConceptScheme
description: EHRI Authority List of Camps is predominantly based on the USHMM Encyclopedia of Camps and Ghettos (volumes 1-3). Other sources for primary and alternative name labels, geographic coordinates, and hierarchical relationships came from the International Tracing Service, Wikidata, Wikipedia, and Bundesarchiv.
top concept of: 1944
top concept of: 2909
top concept of: 3144
top concept of: 2531
top concept of: 1566
top concept of: 2035
top concept of: 1842
top concept of: 1048
top concept of: 1699
top concept of: 1975
top concept of: 2997
top concept of: 3152
top concept of: 2797
top concept of: 2550
top concept of: 1850
top concept of: 2872
top concept of: 2062
top concept of: 1044
top concept of: 2683
top concept of: 3050
top concept of: 2641
top concept of: 321
top concept of: 1983
top concept of: 1309
top concept of: 1642
top concept of: 1177
top concept of: 932
top concept of: 3073
top concept of: 1752
top concept of: 2487
top concept of: 2597
top concept of: 2585
top concept of: 1775
top concept of: 1885
top concept of: 2097
top concept of: 2350
top concept of: 2460
top concept of: 3081
top concept of: 1461
top concept of: 857
top concept of: 2483
top concept of: 2770
top concept of: 2593
top concept of: 1230
top concept of: 1783
top concept of: 1771
top concept of: 1881
top concept of: 1594
top concept of: 2748
top concept of: 1552
top concept of: 1087
top concept of: 2517
top concept of: 1685
top concept of: 140
top concept of: 1277
top concept of: 1371
top concept of: 2215
top concept of: 2325
top concept of: 1140
top concept of: 1526
top concept of: 1681
top concept of: 2348
top concept of: 2458
top concept of: 2911
top concept of: 1916
top concept of: 1273
top concept of: 1659
top concept of: 2117
top concept of: 608
top concept of: 1428
top concept of: 1228
top concept of: 1303
top concept of: 2832
top concept of: 1103
top concept of: 2942
top concept of: 1924
top concept of: 2601