EHRI Ontology
type: Ontology
version IRI: http://lod.ehri-project-test.eu/ontology/0.0.1
imports: https://www.ica.org/standards/RiC/ontology/1.0.2
license: https://creativecommons.org/licenses/by/4.0/
creator: Herminio García-González (Kazerne Dossin)
creator: Mike Bryant (NIOD)
description: This ontology defines the data model used by the EHRI-KG when representing the information hosted in the EHRI Portal. It does so by extending RiC-O v1.0.2 and reusing some of the schema.org concepts.
publisher: EHRI-ERIC
preferred namespace prefix: ehri
preferred namespace uri: http://lod.ehri-project-test.eu/ontology#
code repository: ehri-kg-ontology
version info: v0.0.1

has copy
type: ObjectProperty
sub property of: hasCopy
sub property of: isRelatedTo
inverse of: is copy of
domain: Class
  union of: Institution
  union of: Record Resource
range: Class
  union of: Institution
  union of: Record Resource
comment: This is a generalisation of the rico:hasCopy property to expand the domain and range to ehri:Institution instances.
label: a pour copie @fr
label: tiene como copia @es

is copy of
type: ObjectProperty
sub property of: isCopyOf
sub property of: isRelatedTo
domain: Class
  union of: Institution
  union of: Record Resource
range: Class
  union of: Institution
  union of: Record Resource
comment: Inverse of ehri:hasCopy object property.
label: es copia de @es
label: est la copie de @fr

materials have or had script
type: ObjectProperty
sub property of: isRelatedTo
domain: Record Resource
range: Script of materials
comment: This property allows to indicate the script present in the materials
label: la documentación tiene o tenía como escritura @es
label: la documentation a ou a eu pour écriture @fr

accessibility
type: DatatypeProperty
domain: Institution
range: Literal
comment: Collects information about the institution's accesibility with respect to its archival holdings and services.
label: accesibilidad @es
label: accessibilité @fr

administrative structure
type: DatatypeProperty
domain: Institution
range: Literal
comment: Represents the current administrative structure of an institution
label: estructura administrativa @es
label: structure administrative @fr

appraisal
type: DatatypeProperty
domain: Record
range: Literal
comment: Provides information on any appraisal, destruction and scheduling action.
label: valoración @es
label: évaluation @fr

archival history
type: DatatypeProperty
sub property of: history
domain: Country
range: Literal
comment: Holds information about the Holocaust and WWII and how it relates to the archival landscape.
label: histoire archivistique @fr
label: historia archivística @es

archival situation
type: DatatypeProperty
domain: Country
range: Literal
comment: Offers a short introduction to the archival situation and culture in a country.
label: situación de los archivos @es
label: situation de conservation @fr

archivist note
type: DatatypeProperty
sub property of: note(s)
domain: Record Resource
range: Literal
comment: Explains how the description was prepared and by whom.
label: nota del archivero/a @es
label: notes de l'archiviste @fr

building(s)
type: DatatypeProperty
domain: Institution
range: Literal
comment: Provides information about the buildings of the institution
label: bâtiment(s) @fr
label: edificio(s) @es

contact person
type: DatatypeProperty
domain: Institution's address
range: Literal
comment: To provide the information needed to contact members of the staff.
label: persona de contacto @es
label: personne de contact @fr

finding aids
type: DatatypeProperty
domain: Institution
range: Literal
comment: Provides a general overview of the published and/or published finding aids.
label: instrumentos de descripción @es
label: instruments de recherche @fr

general context
type: DatatypeProperty
sub property of: generalDescription
domain: Institution
range: Literal
comment: Provides information about the geographical and cultural context of the institution.
label: contexte général @fr
label: contexto general @es

conditions of access
type: DatatypeProperty
domain: Institution
range: Literal
comment: Collects information about the conditions, requirements and procedures for access to, and use of institutional services
label: condiciones de acceso @es
label: conditions d'accès @fr

reproduction services
type: DatatypeProperty
domain: Institution
range: Literal
comment: Gather information on the legal status or other regulations that restrict or affect access to the unit of description.
label: services de reproduction @fr
label: servicios de reproducción @es

existence and location of copies
type: DatatypeProperty
domain: Record Resource
range: Literal
comment: Indicates the existence, location and availability of copies of the unit of description.
label: existence et lieu de copies @fr
label: existencia y localización de copias @es

existence and location of copies
type: DatatypeProperty
domain: Record Resource
range: Literal
comment: Indicates the existence, location, availability and/or destruction of originals where the unit of description consists of copies
label: existence et lieu des originaux @fr
label: existencia y localización de los originales @es

note(s)
type: DatatypeProperty
domain: Record Resource
range: Literal
comment: Provides information that cannot be accommodated in any of the other data properties
label: nota(s) @es

finding aids
type: DatatypeProperty
domain: Record Resource
range: Literal
comment: Provide information on the history of the unit of description that is significant for its authenticity, integrity and interpretation.
label: instrumentos de descripción @es
label: instruments de recherche @fr

physical characteristics and technical requirements
type: DatatypeProperty
domain: Record Resource
range: Literal
comment: Collects information about any important physical characteristics or technical requirements that affect use of the unit of description.
label: características físicas y requisitos técnicos @es
label: caractéristiques matérielles et contraintes techniques @fr

public areas
type: DatatypeProperty
domain: Institution
range: Literal
comment: Collects information about areas of the institution available for public use.
label: espaces publics @fr
label: espacios públicos @es

records management and collecting policies
type: DatatypeProperty
domain: Institution
range: Literal
comment: Provides information about the records management and collecting policies of the institution with archival holdings.
label: gestion des archives courantes et intermédiaires et politiques de collecte @fr
label: gestión de documentos y política de ingresos @es

related units of description
type: DatatypeProperty
domain: Record Resource
range: Literal
comment: Identifies related units of description.
label: sources complémentaires @fr
label: unidades de descripción relacionadas @es

EHRI research (extensive)
type: DatatypeProperty
domain: Country
range: Literal
comment: Offers information on how EHRI acquiered its data and integrated it into the Portal.
label: investigación del EHRI (ampliado) @es
label: recherche EHRI (extensif) @fr

research services
type: DatatypeProperty
domain: Institution
range: Literal
comment: Describes the research services provided by the institution with archival holdings.
label: services d'aide à la recherche @fr
label: servicios de ayuda a la investigación @es

EHRI research (summary)
type: DatatypeProperty
domain: Country
range: Literal
comment: Elaborates on EHRI's identification work, which is ongoing since October 2010. This section also includes references to aggregators and country-specific research guides.
label: investigación del EHRI (resumen) @es
label: recherche EHRI (récapitulatif) @fr

separated units of description
type: DatatypeProperty
domain: Record Resource
range: Literal
comment: Information about materials that are associated by provenance to the described materials but that have been physically separated or removed. Items may be separated for various reasons, including the dispersal of special formats to more appropriate custodial units; the outright destruction of duplicate or nonessential material; and the deliberate or unintentional scattering of fonds among different repositories.
label: sources séparées @fr
label: unidadades de descripción separadas @es

sources
type: DatatypeProperty
domain: Class
  union of: Record Resource
  union of: Agent
range: Literal
comment: Record notes on sources consulted in preparing the description and who prepared it.
label: fuentes @es

internal structure
type: DatatypeProperty
domain: Agent
range: Literal
comment: Describes and/or represents the internal administrative structure(s) of a corporate body or the genealogy of a family.
label: estructura(s) interna(s)/genealogía @es
label: structure interne @fr

publication note
type: DatatypeProperty
domain: Record Resource
range: Literal
comment: Identifies any publications that are about or are based on the use, study, or analysis of the unit of description.
label: bibliographie @fr
label: nota de publicaciones @es

contact type
type: DatatypeProperty
domain: PostalAddress
range: Literal
comment: A person or organization can have different contact points, for different purposes. For example, a sales contact point, a PR contact point and so on. This property is used to specify the kind of contact point.
label: tipo de contacto @es
label: type de contact @fr

email address
type: DatatypeProperty
domain: PostalAddress
range: Literal
comment: Email address.
label: adresse email @fr
label: dirección de correo electrónico @es

fax number
type: DatatypeProperty
domain: PostalAddress
range: Literal
comment: The fax number.
label: numéro de fax @fr
label: número de fax @es

opening hours
type: DatatypeProperty
domain: ArchiveOrganization
range: Literal
comment: The general opening hours for a business.
label: heures d'ouverture @fr
label: horarios de apertura @es

postal code
type: DatatypeProperty
domain: PostalAddress
range: Literal
comment: The postal code.
label: code postal @fr
label: código postal @es

telephone number
type: DatatypeProperty
domain: PostalAddress
range: Literal
comment: The telephone number.
label: numéro de téléphone @fr
label: número de teléfono @es

Alternative forms of the agent's name
type: Class
subclass of: AgentName
label: Formas alternativas del nombre @es
label: Formes alternatives du nom @fr

City
type: Class
subclass of: Place
label: Ciudad @es
label: Ville @fr

Corporate body
type: Class
subclass of: CorporateBody
label: Collectivité @fr
label: Persona jurídica @es

Country
type: Class
subclass of: Place
label: Pays @fr
label: País @es

Family
type: Class
subclass of: Family
label: Familia @es
label: Famille @fr

Institution
type: Class
subclass of: Corporate body
subclass of: ArchiveOrganization
label: Institución @es

Institution's address
type: Class
subclass of: PostalAddress
subclass of: PhysicalLocation
label: Adresse de l'institution @fr
label: Dirección de la institución @es

Script of materials
type: Class
subclass of: Concept
label: Escritura de la documentación @es
label: Écriture des documents @fr

Parallel forms of the agent's name
type: Class
subclass of: AgentName
label: Formas paralelas del nombre @es
label: Formes parallèles du nom @fr

Person
type: Class
subclass of: Person
label: Persona @es
label: Personne @fr

Record Resource
type: Class
subclass of: RecordResource
label: Recurso documental @es
label: Ressource archivistique @fr

Region
type: Class
subclass of: Place
label: Región @es
label: Région @fr

record group
type: NamedIndividual
type: Concept
type: RecordSetType
in scheme: recordSetTypes
top concept of: recordSetTypes
label: groupe d'enregistrement @fr
label: unidad documental compuesta @es

sub-collection
type: NamedIndividual
type: Concept
type: RecordSetType
in scheme: recordSetTypes
top concept of: recordSetTypes
label: sous-collection @fr
label: subcolección @es

sub-fonds
type: NamedIndividual
type: Concept
type: RecordSetType
in scheme: recordSetTypes
top concept of: recordSetTypes
label: sous-fonds @fr
label: subfondo @es

sub-group
type: NamedIndividual
type: Concept
type: RecordSetType
in scheme: recordSetTypes
top concept of: recordSetTypes
label: sous-groupe @fr
label: subunidad documental compuesta @es

sub-series
type: NamedIndividual
type: Concept
type: RecordSetType
in scheme: recordSetTypes
top concept of: recordSetTypes
label: sous-série @fr
label: subserie @es